Target
Adenosine deaminase
Ligand
BDBM22925
Substrate
Meas. Tech.
ChEMBL_30799 (CHEMBL645075)
Ki
0.001000±n/a nM
Citation
 Cristalli, GEleuteri, AVolpini, RVittori, SCamaioni, ELupidi, G Adenosine deaminase inhibitors: synthesis and structure-activity relationships of 2-hydroxy-3-nonyl derivatives of azoles. J Med Chem 37:201-5 (1994)  
Target
Name:
Adenosine deaminase
Synonyms:
ADA Adenosine aminohydrolase
Type:
Enzyme
Mol. Mass.:
40910.44
Organism:
Bos taurus (bovine)
Description:
Residue:
363
  
Inhibitor
Name:
BDBM22925
Synonyms:
(8R)-3-[(2R,4S,5R)-4-hydroxy-5-(hydroxymethyl)oxolan-2-yl]-3H,6H,7H,8H-imidazo[4,5-d][1,3]diazepin-8-ol Deoxycoformycin Pentostatin
Type:
Nucleoside or nucleotide
Emp. Form.:
C11H16N4O4
Mol. Mass.:
268.2691
SMILES:
OC[C@H]1O[C@H](C[C@@H]1O)n1cnc2[C@H](O)CNC=Nc12
: