Target
Acyl-CoA:cholesterol acyltransferase
Ligand
BDBM50041733
Substrate
Meas. Tech.
ChEMBL_28198 (CHEMBL637691)
IC50
11±n/a nM
Citation
 Trivedi, BKPurchase, TSHolmes, AAugelli-Szafran, CEEssenburg, ADHamelehle, KLStanfield, RLBousley, RFKrause, BR Inhibitors of acyl-CoA:cholesterol acyltransferase (ACAT). 7. Development of a series of substituted N-phenyl-N'-[(1-phenylcyclopentyl)methyl]ureas with enhanced hypocholesterolemic activity. J Med Chem 37:1652-9 (1994)  
Target
Name:
Acyl-CoA:cholesterol acyltransferase
Synonyms:
ACAT
Type:
Mol. Mass.:
35405.31
Organism:
Oryctolagus cuniculus
Description:
Residue:
305
  
Inhibitor
Name:
BDBM50041733
Synonyms:
1-(2,6-Diisopropyl-phenyl)-3-[1-(3-morpholin-4-ylmethyl-phenyl)-cyclopentylmethyl]-urea | CHEMBL295671
Type:
Small organic molecule
Emp. Form.:
C30H43N3O2
Mol. Mass.:
477.6813
SMILES:
CC(C)c1cccc(C(C)C)c1NC(=O)NCC1(CCCC1)c1cccc(CN2CCOCC2)c1
: