Target
Muscarinic acetylcholine receptor M2
Ligand
BDBM50038718
Substrate
Meas. Tech.
ChEMBL_140111 (CHEMBL752112)
Ki
670±n/a nM
Citation
 Hudkins, RLMailman, RBDeHaven-Hudkins, DL Novel (4-phenylpiperidinyl)- and (4-phenylpiperazinyl)alkyl-spaced esters of 1-phenylcyclopentanecarboxylic acids as potent sigma-selective compounds. J Med Chem 37:1964-70 (1994)  
Target
Name:
Muscarinic acetylcholine receptor M2
Synonyms:
ACM2_RAT Chrm-2 | Chrm2
Type:
Enzyme Catalytic Domain
Mol. Mass.:
51555.53
Organism:
RAT
Description:
P10980
Residue:
466
  
Inhibitor
Name:
BDBM50038718
Synonyms:
1-Phenyl-cyclopentanecarboxylic acid 3-(4-phenyl-piperidin-1-yl)-propyl ester; hydrochloride | CHEMBL540013
Type:
Small organic molecule
Emp. Form.:
C26H33NO2
Mol. Mass.:
391.5457
SMILES:
O=C(OCCCN1CCC(CC1)c1ccccc1)C1(CCCC1)c1ccccc1
: