Target
D(1A) dopamine receptor
Ligand
BDBM73402
Substrate
Meas. Tech.
ChEMBL_58642 (CHEMBL666356)
Ki
>1000±n/a nM
Citation
 Hudkins, RLMailman, RBDeHaven-Hudkins, DL Novel (4-phenylpiperidinyl)- and (4-phenylpiperazinyl)alkyl-spaced esters of 1-phenylcyclopentanecarboxylic acids as potent sigma-selective compounds. J Med Chem 37:1964-70 (1994)  
Target
Name:
D(1A) dopamine receptor
Synonyms:
DOPAMINE D1 Dopamine D1 high Dopamine receptor Dopamine1-like Drd1a
Type:
Enzyme Catalytic Domain
Mol. Mass.:
49429.75
Organism:
RAT
Description:
P18901
Residue:
446
  
Inhibitor
Name:
BDBM73402
Synonyms:
1-Phenyl-cyclopentanecarboxylic acid 2-diethylamino-ethyl ester 1-phenylcyclopentanecarboxylic acid 2-(diethylamino)ethyl ester;hydrochloride 2-(diethylamino)ethyl 1-phenylcyclopentanecarboxylate hydrochloride CHEMBL61946 SMR000140237 | cid_67173
Type:
Small organic molecule
Emp. Form.:
C18H27NO2
Mol. Mass.:
289.4125
SMILES:
CCN(CC)CCOC(=O)C1(CCCC1)c1ccccc1
: