Target
Dihydrofolate reductase
Ligand
BDBM50016460
Substrate
Meas. Tech.
ChEMBL_54256 (CHEMBL669252)
IC50
2.6±n/a nM
Citation
 Rosowsky, ABader, HWright, JEKeyomarsi, KMatherly, LH Synthesis and biological activity of N omega-hemiphthaloyl-alpha,omega- diaminoalkanoic acid analogues of aminopterin and 3',5-dichloroaminopterin. J Med Chem 37:2167-74 (1994)  
Target
Name:
Dihydrofolate reductase
Synonyms:
DHFR Dihydrofolate reductase (DHFR) | Tetrahydrofolate dehydrogenase
Type:
Enzyme
Mol. Mass.:
21453.99
Organism:
Homo sapiens (Human)
Description:
Recombinant human DHFR.
Residue:
187
  
Inhibitor
Name:
BDBM50016460
Synonyms:
(S)-2-{4-[1-(2,4-Diamino-pteridin-6-ylmethyl)-propyl]-benzoylamino}-pentanedioic acid Edatrexate TCMDC-137768
Type:
Small organic molecule
Emp. Form.:
C22H25N7O5
Mol. Mass.:
467.4778
SMILES:
CCC(Cc1cnc2nc(N)nc(N)c2n1)c1ccc(cc1)C(=O)N[C@@H](CCC(O)=O)C(O)=O
: