Target
Sodium-dependent dopamine transporter
Ligand
BDBM50039175
Substrate
Meas. Tech.
ChEMBL_62490 (CHEMBL677547)
Ki
78±n/a nM
Citation
 Newman, AHAllen, ACIzenwasser, SKatz, JL Novel 3 alpha-(diphenylmethoxy)tropane analogs: potent dopamine uptake inhibitors without cocaine-like behavioral profiles. J Med Chem 37:2258-61 (1994)  
Target
Name:
Sodium-dependent dopamine transporter
Synonyms:
DA transporter SC6A3_RAT Sodium-dependent dopamine transporter | Sodium-dependent dopamine transporter (DAT)
Type:
Multi-pass membrane protein
Mol. Mass.:
68749.45
Organism:
Rattus norvegicus (rat)
Description:
P23977
Residue:
619
  
Inhibitor
Name:
BDBM50039175
Synonyms:
3-[(4-Methoxy-phenyl)-phenyl-methoxy]-8-methyl-8-aza-bicyclo[3.2.1]octane; hydrochloride CHEMBL557818
Type:
Small organic molecule
Emp. Form.:
C22H27NO2
Mol. Mass.:
337.4553
SMILES:
COc1ccc(cc1)C(OC1CC2CCC(C1)N2C)c1ccccc1
: