Target
Sigma non-opioid intracellular receptor 1
Ligand
BDBM50039189
Substrate
Meas. Tech.
ChEMBL_201099 (CHEMBL807414)
Ki
22±n/a nM
Citation
 Calderon, SNIzenwasser, SHeller, BGutkind, JSMattson, MVSu, TPNewman, AH Novel 1-phenylcycloalkanecarboxylic acid derivatives are potent and selective sigma 1 ligands. J Med Chem 37:2285-91 (1994)  
Target
Name:
Sigma non-opioid intracellular receptor 1
Synonyms:
Opioid receptor SGMR1_RAT Sigma non-opioid intracellular receptor 1 Sigma-1 | Sigmar1
Type:
Enzyme Catalytic Domain
Mol. Mass.:
25266.54
Organism:
RAT
Description:
Q9R0C9
Residue:
223
  
Inhibitor
Name:
BDBM50039189
Synonyms:
1-(3,4-Dichloro-phenyl)-cyclohexanecarboxylic acid 2-diethylamino-ethoxymethyl ester | CHEMBL75217
Type:
Small organic molecule
Emp. Form.:
C20H29Cl2NO3
Mol. Mass.:
402.355
SMILES:
CCN(CC)CCOCOC(=O)C1(CCCCC1)c1ccc(Cl)c(Cl)c1
: