Target
Sodium-dependent dopamine transporter
Ligand
BDBM50453094
Substrate
Meas. Tech.
ChEMBL_62180 (CHEMBL672119)
IC50
2.1±n/a nM
Citation
 Carroll, FIMascarella, SWKuzemko, MAGao, YAbraham, PLewin, AHBoja, JWKuhar, MJ Synthesis, ligand binding, and QSAR (CoMFA and classical) study of 3 beta-(3'-substituted phenyl)-, 3 beta-(4'-substituted phenyl)-, and 3 beta-(3',4'-disubstituted phenyl)tropane-2 beta-carboxylic acid methyl esters. J Med Chem 37:2865-73 (1994)  
Target
Name:
Sodium-dependent dopamine transporter
Synonyms:
DA transporter SC6A3_RAT Sodium-dependent dopamine transporter | Sodium-dependent dopamine transporter (DAT)
Type:
Multi-pass membrane protein
Mol. Mass.:
68749.45
Organism:
Rattus norvegicus (rat)
Description:
P23977
Residue:
619
  
Inhibitor
Name:
BDBM50453094
Synonyms:
CHEMBL2310852
Type:
Small organic molecule
Emp. Form.:
C16H20N4O2
Mol. Mass.:
300.3556
SMILES:
[H][C@@]12CCC([C@H]([C@H](C1)c1ccc(cc1)N=[N+]=[N-])C(=O)OC)N2C
: