Target
Sodium channel protein type 2 subunit alpha
Ligand
BDBM50043999
Substrate
Meas. Tech.
ChEMBL_144081 (CHEMBL753044)
IC50
32000±n/a nM
Citation
 Roufos, IHays, SJDooley, DJSchwarz, RDCampbell, GWProbert, AW Synthesis and pharmacological evaluation of phenylacetamides as sodium-channel blockers. J Med Chem 37:268-74 (1994)  
Target
Name:
Sodium channel protein type 2 subunit alpha
Synonyms:
SCN2A_RAT Scn2a1 Sodium channel protein type 2 subunit alpha Sodium channel protein type II subunit alpha Voltage-gated sodium channel | Voltage-gated sodium channel subunit alpha Nav1.2
Type:
PROTEIN
Mol. Mass.:
227854.11
Organism:
Rattus norvegicus
Description:
ChEMBL_1516893
Residue:
2005
  
Inhibitor
Name:
BDBM50043999
Synonyms:
CHEMBL93838 | N-[3-(2,6-Dimethyl-piperidin-1-yl)-propyl]-2,2-diphenyl-propionamide
Type:
Small organic molecule
Emp. Form.:
C25H34N2O
Mol. Mass.:
378.5503
SMILES:
CC1CCCC(C)N1CCCNC(=O)C(C)(c1ccccc1)c1ccccc1
: