Target
Sodium channel protein type 2 subunit alpha
Ligand
BDBM50044001
Substrate
Meas. Tech.
ChEMBL_144081 (CHEMBL753044)
IC50
3100±n/a nM
Citation
 Roufos, IHays, SJDooley, DJSchwarz, RDCampbell, GWProbert, AW Synthesis and pharmacological evaluation of phenylacetamides as sodium-channel blockers. J Med Chem 37:268-74 (1994)  
Target
Name:
Sodium channel protein type 2 subunit alpha
Synonyms:
SCN2A_RAT Scn2a1 Sodium channel protein type 2 subunit alpha Sodium channel protein type II subunit alpha Voltage-gated sodium channel | Voltage-gated sodium channel subunit alpha Nav1.2
Type:
PROTEIN
Mol. Mass.:
227854.11
Organism:
Rattus norvegicus
Description:
ChEMBL_1516893
Residue:
2005
  
Inhibitor
Name:
BDBM50044001
Synonyms:
CHEMBL93106 | N-[3-(2,6-Dimethyl-piperidin-1-yl)-propyl]-2,2-bis-(4-methoxy-phenyl)-acetamide
Type:
Small organic molecule
Emp. Form.:
C26H36N2O3
Mol. Mass.:
424.5756
SMILES:
COc1ccc(cc1)C(C(=O)NCCCN1C(C)CCCC1C)c1ccc(OC)cc1
: