Target
Beta-glucosidase A
Ligand
BDBM50403869
Substrate
Meas. Tech.
ChEMBL_37567 (CHEMBL647648)
IC50
230000±n/a nM
Citation
 Asano, NOseki, KKizu, HMatsui, K Nitrogen-in-the-ring pyranoses and furanoses: structural basis of inhibition of mammalian glycosidases. J Med Chem 37:3701-6 (1994)  
Target
Name:
Beta-glucosidase A
Synonyms:
BGLS_CALSA | bglA
Type:
PROTEIN
Mol. Mass.:
53484.21
Organism:
Caldocellum saccharolyticum
Description:
ChEMBL_37437
Residue:
455
  
Inhibitor
Name:
BDBM50403869
Synonyms:
CHEMBL2115197
Type:
Small organic molecule
Emp. Form.:
C6H13NO2
Mol. Mass.:
131.1729
SMILES:
CC[C@H]1NC[C@H](O)[C@@H]1O
: