Target
Mu-type opioid receptor
Ligand
BDBM50041147
Substrate
Meas. Tech.
ChEMBL_138758 (CHEMBL747844)
IC50
609±n/a nM
Citation
 Schmidt, RVogel, DMrestani-Klaus, CBrandt, WNeubert, KChung, NNLemieux, CSchiller, PW Cyclic beta-casomorphin analogues with mixed mu agonist/delta antagonist properties: synthesis, pharmacological characterization, and conformational aspects. J Med Chem 37:1136-44 (1994)  
Target
Name:
Mu-type opioid receptor
Synonyms:
M-OR-1 Mu opioid receptor OPIATE Mu OPRM_CAVPO
Type:
Enzyme Catalytic Domain
Mol. Mass.:
11165.58
Organism:
GUINEA PIG
Description:
P97266
Residue:
98
  
Inhibitor
Name:
BDBM50041147
Synonyms:
(S)-2-Amino-3-(4-hydroxy-phenyl)-N-((5S,8S,17aR)-5-naphthalen-2-ylmethyl-4,7,14,17-tetraoxo-hexadecahydro-3a,6,13,16-tetraaza-cyclopentacyclohexadecen-8-yl)-propionamide | CHEMBL274012
Type:
Small organic molecule
Emp. Form.:
C35H42N6O6
Mol. Mass.:
642.7446
SMILES:
N[C@@H](Cc1ccc(O)cc1)C(=O)N[C@H]1CCCCNC(=O)CNC(=O)[C@H]2CCCN2C(=O)[C@H](Cc2ccc3ccccc3c2)NC1=O
: