Target
Delta-type opioid receptor
Ligand
BDBM50041145
Substrate
Meas. Tech.
ChEMBL_146496 (CHEMBL754606)
Ki
3.99±n/a nM
Citation
 Schmidt, RVogel, DMrestani-Klaus, CBrandt, WNeubert, KChung, NNLemieux, CSchiller, PW Cyclic beta-casomorphin analogues with mixed mu agonist/delta antagonist properties: synthesis, pharmacological characterization, and conformational aspects. J Med Chem 37:1136-44 (1994)  
Target
Name:
Delta-type opioid receptor
Synonyms:
Cytochrome P450 3A4 Delta opioid receptor Delta-type opioid receptor (DOR) OPRD_RAT Opioid receptor Opioid receptors; mu & delta Ror-a | Voltage-gated potassium channel
Type:
G Protein-Coupled Receptor (GPCR)
Mol. Mass.:
40465.04
Organism:
Rattus norvegicus (rat)
Description:
Competition binding assays were using CHO-K1 cell membranes expressing the opioid receptor.
Residue:
372
  
Inhibitor
Name:
BDBM50041145
Synonyms:
(S)-2-Amino-3-(4-hydroxy-phenyl)-N-((5S,8S)-5-naphthalen-2-ylmethyl-4,7,13,16-tetraoxo-hexadecahydro-3a,6,12,15-tetraaza-cyclopentacyclopentadecen-8-yl)-propionamide | CHEMBL2370199
Type:
Small organic molecule
Emp. Form.:
C30H38N6O6
Mol. Mass.:
578.6593
SMILES:
[H][C@@]12CCCN1C(=O)[C@H](Cc1ccccc1)NC(=O)[C@@H](CCCNC(=O)CNC2=O)NC(=O)[C@@H](N)Cc1ccc(O)cc1
: