Target
Aminopeptidase N
Ligand
BDBM50036821
Substrate
Meas. Tech.
ChEMBL_35506 (CHEMBL646416)
Ki
4500±n/a nM
Citation
 Chauvel, ENCoric, PLlorens-Cortès, CWilk, SRoques, BPFournié-Zaluski, MC Investigation of the active site of aminopeptidase A using a series of new thiol-containing inhibitors. J Med Chem 37:1339-46 (1994)  
Target
Name:
Aminopeptidase N
Synonyms:
AMPN_HUMAN APN Aminopeptidase CD_antigen=CD13 Myeloid plasma membrane glycoprotein CD13 gp150 | hAPN
Type:
PROTEIN
Mol. Mass.:
109522.63
Organism:
Homo sapiens (Human)
Description:
ChEMBL_1507526
Residue:
967
  
Inhibitor
Name:
BDBM50036821
Synonyms:
(S)-5-Mercapto-4-methylamino-pentanoic acid | CHEMBL27824
Type:
Small organic molecule
Emp. Form.:
C6H13NO2S
Mol. Mass.:
163.238
SMILES:
CN[C@H](CS)CCC(O)=O
: