Target
Neprilysin
Ligand
BDBM50035240
Substrate
Meas. Tech.
ChEMBL_144457 (CHEMBL755104)
IC50
8±n/a nM
Citation
 Bihovsky, RLevinson, BLLoewi, RCErhardt, PWPolokoff, MA Hydroxamic acids as potent inhibitors of endothelin-converting enzyme from human bronchiolar smooth muscle. J Med Chem 38:2119-29 (1995)  
Target
Name:
Neprilysin
Synonyms:
Atriopeptidase CD_antigen=CD10 MME NEP_RABIT Neutral endopeptidase 24.11
Type:
Enzyme
Mol. Mass.:
85570.75
Organism:
Oryctolagus cuniculus (rabbit)
Description:
NEP was purified to homogeneity from rabbit kidney.
Residue:
750
  
Inhibitor
Name:
BDBM50035240
Synonyms:
(2-Hydroxycarbamoyl-3-methyl-butyrylamino)-acetic acid | CHEMBL67000
Type:
Small organic molecule
Emp. Form.:
C8H14N2O5
Mol. Mass.:
218.2072
SMILES:
CC(C)C(C(=O)NO)C(=O)NCC(O)=O
: