Target
D(3) dopamine receptor
Ligand
BDBM50035307
Substrate
Meas. Tech.
ChEMBL_62902 (CHEMBL676141)
Ki
22±n/a nM
Citation
 Ennis, MDStjernlöf, PHoffman, RLGhazal, NBSmith, MWSvensson, KWikström, HHaadsma-Svensson, SRLin, CH Structure-activity relationships in the 8-amino-6,7,8,9-tetrahydro-3H-benz[e]indole ring system. 2. Effects of 8-amino nitrogen substitution on serotonin receptor binding and pharmacology. J Med Chem 38:2217-30 (1995)  
Target
Name:
D(3) dopamine receptor
Synonyms:
DOPAMINE D3 Dopamine D3 receptor | Drd3
Type:
Protein
Mol. Mass.:
49540.58
Organism:
Rattus norvegicus (Rat)
Description:
P19020
Residue:
446
  
Inhibitor
Name:
BDBM50035307
Synonyms:
CHEMBL302171 S-(-)-Dipropyl-(6,7,8,9-tetrahydro-3H-benzo[e]indol-8-yl)-amine
Type:
Small organic molecule
Emp. Form.:
C18H26N2
Mol. Mass.:
270.4124
SMILES:
CCCN(CCC)[C@H]1CCc2ccc3[nH]ccc3c2C1
: