Target
Alpha-2B adrenergic receptor
Ligand
BDBM50030619
Substrate
Meas. Tech.
ChEMBL_33355 (CHEMBL644759)
Ki
14±n/a nM
Citation
 Ruffolo, RRBondinell, WHieble, JP Alpha- and beta-adrenoceptors: from the gene to the clinic. 2. Structure-activity relationships and therapeutic applications. J Med Chem 38:3681-716 (1995)  
Target
Name:
Alpha-2B adrenergic receptor
Synonyms:
ADA2B_HUMAN ADRA2L1 Adrenergic alpha2B Adrenergic receptor alpha Alpha-2 adrenergic receptor subtype C2 Alpha-2B adrenoreceptor | Alpha-2BAR
Type:
Enzyme
Mol. Mass.:
49964.20
Organism:
Homo sapiens (Human)
Description:
P18089
Residue:
450
  
Inhibitor
Name:
BDBM50030619
Synonyms:
1-Bromo-5-chloro-8-methyl-6,7,8,9-tetrahydro-2-oxa-8-aza-benzo[cd]azulene SK&F-105854 | SK-105854
Type:
Small organic molecule
Emp. Form.:
C12H11BrClNO
Mol. Mass.:
300.579
SMILES:
CN1CCc2c(Cl)ccc3oc(Br)c(C1)c23
: