Target
Alpha-1A adrenergic receptor
Ligand
BDBM50030617
Substrate
Meas. Tech.
ChEMBL_33729 (CHEMBL647045)
Ki
1.3±n/a nM
Citation
 Ruffolo, RRBondinell, WHieble, JP Alpha- and beta-adrenoceptors: from the gene to the clinic. 2. Structure-activity relationships and therapeutic applications. J Med Chem 38:3681-716 (1995)  
Target
Name:
Alpha-1A adrenergic receptor
Synonyms:
ADA1A_HUMAN ADRA1C Alpha 1A-adrenoceptor Alpha adrenergic receptor 1a Alpha-adrenergic receptor 1c adrenergic Alpha1 | adrenergic Alpha1C
Type:
Cell-surface receptors
Mol. Mass.:
51511.67
Organism:
Homo sapiens (Human)
Description:
P35348
Residue:
466
  
Inhibitor
Name:
BDBM50030617
Synonyms:
2,6-Dimethyl-4-(4-nitro-phenyl)-pyridine-3,5-dicarboxylic acid 3-amide 5-{[3-(4,4-diphenyl-piperidin-1-yl)-propyl]-amide} | CHEMBL122671
Type:
Small organic molecule
Emp. Form.:
C35H37N5O4
Mol. Mass.:
591.6994
SMILES:
Cc1nc(C)c(C(=O)NCCCN2CCC(CC2)(c2ccccc2)c2ccccc2)c(-c2ccc(cc2)[N+]([O-])=O)c1C(N)=O
: