Target
Prostaglandin G/H synthase 2
Ligand
BDBM50022309
Substrate
Meas. Tech.
ChEMBL_159929 (CHEMBL769654)
IC50
284000±n/a nM
Citation
 Wilkerson, WWCopeland, RACovington, MTrzaskos, JM Antiinflammatory 4,5-diarylpyrroles. 2. Activity as a function of cyclooxygenase-2 inhibition. J Med Chem 38:3895-901 (1995)  
Target
Name:
Prostaglandin G/H synthase 2
Synonyms:
COX2 Cyclooxygenase 2 (COX-2) Cyclooxygenase-2 (COX-2 AA) Cyclooxygenase-2 (COX-2) PGH2_HUMAN PHS II Prostaglandin E synthase/G/H synthase 2 Prostaglandin-endoperoxide synthase 2
Type:
Enzyme
Mol. Mass.:
69003.89
Organism:
Homo sapiens (Human)
Description:
Recombinant Cox-2 provided by Cayman (Cayman Chemical Co.,Ann Arbor, MI).
Residue:
604
  
Inhibitor
Name:
BDBM50022309
Synonyms:
3,5-Dioxo-1,2-diphenyl-4-n-butylpyrazolidine 4-n-Butyl-1,2-diphenyl-3,5-pyrazolidinedione PHENYLBUTAZONE | Phenylbutazon
Type:
Small organic molecule
Emp. Form.:
C19H20N2O2
Mol. Mass.:
308.3743
SMILES:
CCCCc1c(O)n(-c2ccccc2)n(-c2ccccc2)c1=O
: