Target
D(2) dopamine receptor
Ligand
BDBM50029251
Substrate
Meas. Tech.
ChEMBL_62394 (CHEMBL672949)
Ki
10±n/a nM
Citation
 Scott, MKBaxter, EWBennett, DJBoyd, REBlum, PSCodd, EEKukla, MJMalloy, EMaryanoff, BEMaryanoff, CA Piperazinylalkyl heterocycles as potential antipsychotic agents. J Med Chem 38:4198-210 (1995)  
Target
Name:
D(2) dopamine receptor
Synonyms:
DOPAMINE D2 DOPAMINE D2 Short Dopamine D2 receptor Drd2
Type:
G Protein-Coupled Receptor (GPCR)
Mol. Mass.:
50931.60
Organism:
Rattus norvegicus (rat)
Description:
P61169
Residue:
444
  
Inhibitor
Name:
BDBM50029251
Synonyms:
CHEMBL543905 | {5-[4-(2-Isopropoxy-phenyl)-piperazin-1-ylmethyl]-1-methyl-1H-pyrrol-2-yl}-piperidin-1-yl-methanone; hydrochloride
Type:
Small organic molecule
Emp. Form.:
C25H36N4O2
Mol. Mass.:
424.5789
SMILES:
CC(C)Oc1ccccc1N1CCN(Cc2ccc(C(=O)N3CCCCC3)n2C)CC1
: