Target
D(2) dopamine receptor
Ligand
BDBM50029274
Substrate
Meas. Tech.
ChEMBL_62394 (CHEMBL672949)
Ki
>30±n/a nM
Citation
 Scott, MKBaxter, EWBennett, DJBoyd, REBlum, PSCodd, EEKukla, MJMalloy, EMaryanoff, BEMaryanoff, CA Piperazinylalkyl heterocycles as potential antipsychotic agents. J Med Chem 38:4198-210 (1995)  
Target
Name:
D(2) dopamine receptor
Synonyms:
DOPAMINE D2 DOPAMINE D2 Short Dopamine D2 receptor Drd2
Type:
G Protein-Coupled Receptor (GPCR)
Mol. Mass.:
50931.60
Organism:
Rattus norvegicus (rat)
Description:
P61169
Residue:
444
  
Inhibitor
Name:
BDBM50029274
Synonyms:
N-Benzyl-N-{5-[4-(2-methoxy-phenyl)-piperazin-1-ylmethyl]-1-methyl-1H-pyrrol-2-ylmethyl}-benzamide;succinate
Type:
Small organic molecule
Emp. Form.:
C32H36N4O2
Mol. Mass.:
508.6538
SMILES:
COc1ccccc1N1CCN(Cc2ccc(CN(Cc3ccccc3)C(=O)c3ccccc3)n2C)CC1
: