Target
5-hydroxytryptamine receptor 1A
Ligand
BDBM50029260
Substrate
Meas. Tech.
ChEMBL_1143 (CHEMBL616088)
Ki
3.2±n/a nM
Citation
 Scott, MKBaxter, EWBennett, DJBoyd, REBlum, PSCodd, EEKukla, MJMalloy, EMaryanoff, BEMaryanoff, CA Piperazinylalkyl heterocycles as potential antipsychotic agents. J Med Chem 38:4198-210 (1995)  
Target
Name:
5-hydroxytryptamine receptor 1A
Synonyms:
5-HT-1A 5-HT1A 5-hydroxytryptamine receptor 1A (5HT1A) 5ht1a Htr1a Serotonin 1a (5-HT1a) receptor/Adrenergic receptor alpha-1 | Serotonin receptor 1A
Type:
G Protein-Coupled Receptor (GPCR)
Mol. Mass.:
46445.29
Organism:
Rattus norvegicus (rat)
Description:
Binding assays were performed using rat hippocampal membranes.
Residue:
422
  
Inhibitor
Name:
BDBM50029260
Synonyms:
Azepan-1-yl-{5-[4-(2-isopropoxy-phenyl)-piperazin-1-ylmethyl]-thiophen-2-yl}-methanone; hydrochloride | CHEMBL538280
Type:
Small organic molecule
Emp. Form.:
C25H35N3O2S
Mol. Mass.:
441.629
SMILES:
CC(C)Oc1ccccc1N1CCN(Cc2ccc(s2)C(=O)N2CCCCCC2)CC1
: