Target
D(2) dopamine receptor
Ligand
BDBM50029311
Substrate
Meas. Tech.
ChEMBL_63038 (CHEMBL678341)
Ki
23±n/a nM
Citation
 Reitz, ABBaxter, EWBennett, DJCodd, EEJordan, ADMalloy, EAMaryanoff, BEMcDonnell, MEOrtegon, MERenzi, MJ N-aryl-N'-benzylpiperazines as potential antipsychotic agents. J Med Chem 38:4211-22 (1995)  
Target
Name:
D(2) dopamine receptor
Synonyms:
DOPAMINE D2 DOPAMINE D2 Short Dopamine D2 receptor Drd2
Type:
G Protein-Coupled Receptor (GPCR)
Mol. Mass.:
50931.60
Organism:
Rattus norvegicus (rat)
Description:
P61169
Residue:
444
  
Inhibitor
Name:
BDBM50029311
Synonyms:
3-{3-[4-(2-Isopropoxy-phenyl)-piperazin-1-ylmethyl]-benzyl}-imidazolidine-2,4-dione | CHEMBL443546
Type:
Small organic molecule
Emp. Form.:
C24H30N4O3
Mol. Mass.:
422.52
SMILES:
CC(C)Oc1ccccc1N1CCN(Cc2cccc(Cn3c(O)c[nH]c3=O)c2)CC1
: