Target
Adenosine receptor A3
Ligand
BDBM50454081
Substrate
Meas. Tech.
ChEMBL_30466 (CHEMBL643127)
Ki
1090±n/a nM
Citation
 Siddiqi, SMJacobson, KAEsker, JLOlah, MEJi, XDMelman, NTiwari, KNSecrist, JASchneller, SWCristalli, G Search for new purine- and ribose-modified adenosine analogues as selective agonists and antagonists at adenosine receptors. J Med Chem 38:1174-88 (1995)  
Target
Name:
Adenosine receptor A3
Synonyms:
AA3R_RAT Adenosine receptor A2a and A3 | Adora3
Type:
PROTEIN
Mol. Mass.:
36643.73
Organism:
Rattus norvegicus
Description:
ChEMBL_479910
Residue:
320
  
Inhibitor
Name:
BDBM50454081
Synonyms:
CHEMBL2079643
Type:
Small organic molecule
Emp. Form.:
C10H12ClN5O3S
Mol. Mass.:
317.752
SMILES:
Nc1nc(Cl)nc2n(cnc12)[C@@H]1S[C@H](CO)[C@@H](O)[C@H]1O
: