Target
Adenosine receptor A3
Ligand
BDBM50088426
Substrate
Meas. Tech.
ChEMBL_30466 (CHEMBL643127)
Ki
200000±n/a nM
Citation
 Siddiqi, SMJacobson, KAEsker, JLOlah, MEJi, XDMelman, NTiwari, KNSecrist, JASchneller, SWCristalli, G Search for new purine- and ribose-modified adenosine analogues as selective agonists and antagonists at adenosine receptors. J Med Chem 38:1174-88 (1995)  
Target
Name:
Adenosine receptor A3
Synonyms:
AA3R_RAT Adenosine receptor A2a and A3 | Adora3
Type:
PROTEIN
Mol. Mass.:
36643.73
Organism:
Rattus norvegicus
Description:
ChEMBL_479910
Residue:
320
  
Inhibitor
Name:
BDBM50088426
Synonyms:
(1R,2S,3R,5R)-3-(6-amino-9H-purin-9-yl)-5-(hydroxymethyl)cyclopentane-1,2-diol CHEMBL49935
Type:
Small organic molecule
Emp. Form.:
C11H15N5O3
Mol. Mass.:
265.2685
SMILES:
Nc1ncnc2n(cnc12)[C@@H]1C[C@H](CO)[C@@H](O)[C@H]1O
: