Target
D(3) dopamine receptor
Ligand
BDBM50016777
Substrate
Meas. Tech.
ChEMBL_62934 (CHEMBL673839)
Ki
179±n/a nM
Citation
 Sonesson, CBarf, TNilsson, JDijkstra, DCarlsson, ASvensson, KSmith, MWMartin, IJDuncan, JNKing, LJ Synthesis and evaluation of pharmacological and pharmacokinetic properties of monopropyl analogs of 5-, 7-, and 8-[[(trifluoromethyl)sulfonyl]oxy]-2-aminotetralins: central dopamine and serotonin receptor activity. J Med Chem 38:1319-29 (1995)  
Target
Name:
D(3) dopamine receptor
Synonyms:
DOPAMINE D3 DRD3_HUMAN Dopamine D3 receptor (D3) Dopamine receptor Dopamine receptor D3
Type:
Mol. Mass.:
44243.43
Organism:
Homo sapiens (Human)
Description:
Residue:
400
  
Inhibitor
Name:
BDBM50016777
Synonyms:
((R)-8-Hydroxy-1,2,3,4-tetrahydro-naphthalen-2-yl)-dipropyl-ammonium (R)-7-Dipropylamino-5,6,7,8-tetrahydro-naphthalen-1-ol 7-Dipropylamino-5,6,7,8-tetrahydro-naphthalen-1-ol ((R)-OH-DPAT) CHEMBL26998 | R-(+)-7-Dipropylamino-5,6,7,8-tetrahydro-naphthalen-1-ol
Type:
Small organic molecule
Emp. Form.:
C16H25NO
Mol. Mass.:
247.3758
SMILES:
CCCN(CCC)[C@@H]1CCc2cccc(O)c2C1
: