Target
Metabotropic glutamate receptor 1
Ligand
BDBM17660
Substrate
Meas. Tech.
ChEMBL_105717 (CHEMBL719084)
EC50
200±n/a nM
Citation
 Knöpfel, TKuhn, RAllgeier, H Metabotropic glutamate receptors: novel targets for drug development. J Med Chem 38:1417-26 (1995)  
Target
Name:
Metabotropic glutamate receptor 1
Synonyms:
GRM1_RAT Grm1 Metabotropic glutamate receptor Mglur1 metabotropic glutamate 1/5-D metabotropic glutamate receptor 1 isoform alpha precursor
Type:
Enzyme Catalytic Domain
Mol. Mass.:
133240.47
Organism:
RAT
Description:
metabotropic glutamate 1/2 0 RAT::P23385
Residue:
1199
  
Inhibitor
Name:
BDBM17660
Synonyms:
(2S)-2-amino-3-(3,5-dioxo-1,2,4-oxadiazolidin-2-yl)propanoic acid CHEMBL279956 Quisqualate, L | quisqualic acid
Type:
Small organic molecule
Emp. Form.:
C5H7N3O5
Mol. Mass.:
189.1262
SMILES:
N[C@@H](Cn1oc(=O)[nH]c1=O)C(O)=O
: