Target
Dipeptidyl peptidase 4
Ligand
BDBM50050519
Substrate
Meas. Tech.
ChEMBL_53379 (CHEMBL665783)
IC50
17000±n/a nM
Citation
 Coutts, SJKelly, TASnow, RJKennedy, CABarton, RWAdams, JKrolikowski, DAFreeman, DMCampbell, SJKsiazek, JFBachovchin, WW Structure-activity relationships of boronic acid inhibitors of dipeptidyl peptidase IV. 1. Variation of the P2 position of Xaa-boroPro dipeptides. J Med Chem 39:2087-94 (1996)  
Target
Name:
Dipeptidyl peptidase 4
Synonyms:
ADABP Adenosine deaminase complexing protein 2 CD_antigen=CD26 DPP4 DPPIV Dipeptidyl peptidase 4 (DPP IV) Dipeptidyl peptidase 4 (DPP4) Dipeptidyl peptidase 4 membrane form Dipeptidyl peptidase IV Dipeptidyl peptidase IV (DDP-IV) Dipeptidyl peptidase IV membrane form Dipeptidyl peptidase-IV (DPP-4) T-cell activation antigen CD26 | TP103
Type:
Enzyme
Mol. Mass.:
88271.01
Organism:
Homo sapiens (Human)
Description:
P27487
Residue:
766
  
Inhibitor
Name:
BDBM50050519
Synonyms:
Boronic acid derivative | CHEMBL303131
Type:
Small organic molecule
Emp. Form.:
C10H17BN4O3
Mol. Mass.:
252.078
SMILES:
N[C@@H](Cc1cnc[nH]1)C(=O)N1CCC[C@H]1B(O)O
: