Target
Leukotriene B4 receptor 1
Ligand
BDBM50052028
Substrate
Meas. Tech.
ChEMBL_99646 (CHEMBL709304)
IC50
40±n/a nM
Citation
 Brooks, CDSummers, JB Modulators of leukotriene biosynthesis and receptor activation. J Med Chem 39:2629-54 (1996)  
Target
Name:
Leukotriene B4 receptor 1
Synonyms:
BLT BLTR Chemoattractant receptor-like 1 GPR16 LTB4-R 1 Leukotriene B4 R1 Leukotriene B4 receptor 1 P2Y purinoceptor 7 | P2Y7
Type:
Enzyme Catalytic Domain
Mol. Mass.:
37582.68
Organism:
Homo sapiens (Human)
Description:
Q15722
Residue:
352
  
Inhibitor
Name:
BDBM50052028
Synonyms:
7-[3-(4-Acetyl-2-ethyl-5-hydroxy-phenoxy)-propoxy]-8-propyl-chroman-2-carboxylic acid LY-247826
Type:
Small organic molecule
Emp. Form.:
C26H32O7
Mol. Mass.:
456.5281
SMILES:
CCCc1c(OCCCOc2cc(O)c(cc2CC)C(C)=O)ccc2CCC(Oc12)C(O)=O
: