Target
5-hydroxytryptamine receptor 1A
Ligand
BDBM50033857
Substrate
Meas. Tech.
ChEMBL_828 (CHEMBL615828)
IC50
0.50±n/a nM
Citation
 Perrone, RBerardi, FLeopoldo, MTortorella, VFornaretto, MGCaccia, CMcArthur, RA 1-aryl-4-[(1-tetralinyl)alkyl]piperazines: alkylamido and alkylamino derivatives. Synthesis, 5-HT1A receptor affinity, and selectivity. 3. J Med Chem 39:3195-202 (1996)  
Target
Name:
5-hydroxytryptamine receptor 1A
Synonyms:
5-HT-1A 5-HT1A 5-hydroxytryptamine receptor 1A (5HT1A) 5ht1a Htr1a Serotonin 1a (5-HT1a) receptor/Adrenergic receptor alpha-1 | Serotonin receptor 1A
Type:
G Protein-Coupled Receptor (GPCR)
Mol. Mass.:
46445.29
Organism:
Rattus norvegicus (rat)
Description:
Binding assays were performed using rat hippocampal membranes.
Residue:
422
  
Inhibitor
Name:
BDBM50033857
Synonyms:
1-[3-(5-Methoxy-1,2,3,4-tetrahydro-naphthalen-1-yl)-propyl]-4-phenyl-piperazine | CHEMBL322275
Type:
Small organic molecule
Emp. Form.:
C24H32N2O
Mol. Mass.:
364.5237
SMILES:
COc1cccc2C(CCCN3CCN(CC3)c3ccccc3)CCCc12
: