Target
Beta-lactamase OXA-1
Ligand
BDBM50076680
Substrate
Meas. Tech.
ChEMBL_41193 (CHEMBL653459)
IC50
100±n/a nM
Citation
 Richter, HGAngehrn, PHubschwerlen, CKania, MPage, MGSpecklin, JLWinkler, FK Design, synthesis, and evaluation of 2 beta-alkenyl penam sulfone acids as inhibitors of beta-lactamases. J Med Chem 39:3712-22 (1996)  
Target
Name:
Beta-lactamase OXA-1
Synonyms:
BLO1_ECOLX Class D β-lactamase (OXA-1) oxa1
Type:
Enzyme
Mol. Mass.:
30882.83
Organism:
Escherichia coli (Enterobacteria)
Description:
Q83ZU9
Residue:
276
  
Inhibitor
Name:
BDBM50076680
Synonyms:
CHEMBL6461 Sodium; (2S,3R,5R)-3-((Z)-2-cyano-vinyl)-3-methyl-4,4,7-trioxo-4lambda*6*-thia-1-aza-bicyclo[3.2.0]heptane-2-carboxylate | Sodium; (2S,3S,5R)-3-((Z)-2-cyano-vinyl)-3-methyl-4,4,7-trioxo-4lambda*6*-thia-1-aza-bicyclo[3.2.0]heptane-2-carboxylate
Type:
Small organic molecule
Emp. Form.:
C10H9N2O5S
Mol. Mass.:
269.254
SMILES:
C[C@]1(\C=C\C#N)[C@@H](N2[C@@H](CC2=O)S1(=O)=O)C([O-])=O
: