Target
D(2) dopamine receptor
Ligand
BDBM50053702
Substrate
Meas. Tech.
ChEMBL_58683 (CHEMBL670247)
IC50
18±n/a nM
Citation
 Hrib, NJJurcak, JGBregna, DEBurgher, KLHartman, HBKafka, SKerman, LLKongsamut, SRoehr, JESzewczak, MRWoods-Kettelberger, ATCorbett, R Structure-activity relationships of a series of novel (piperazinylbutyl)thiazolidinone antipsychotic agents related to 3-[4-[4-(6-fluorobenzo[b]thien-3-yl)-1-piperazinyl]butyl]-2,5,5- trimethyl-4-thiazolidinone maleate. J Med Chem 39:4044-57 (1996)  
Target
Name:
D(2) dopamine receptor
Synonyms:
DOPAMINE D2 DOPAMINE D2 Short Dopamine D2 receptor Drd2
Type:
G Protein-Coupled Receptor (GPCR)
Mol. Mass.:
50931.60
Organism:
Rattus norvegicus (rat)
Description:
P61169
Residue:
444
  
Inhibitor
Name:
BDBM50053702
Synonyms:
3-(4-{4-[1-(4-Fluoro-phenyl)-1H-indol-3-yl]-piperazin-1-yl}-butyl)-1-thia-3-aza-spiro[4.5]decan-4-one | CHEMBL131159
Type:
Small organic molecule
Emp. Form.:
C30H37FN4OS
Mol. Mass.:
520.704
SMILES:
Fc1ccc(cc1)-n1cc(N2CCN(CCCCN3CSC4(CCCCC4)C3=O)CC2)c2ccccc12
: