Target
D(2) dopamine receptor
Ligand
BDBM50053700
Substrate
Meas. Tech.
ChEMBL_58562 (CHEMBL667497)
IC50
29±n/a nM
Citation
 Hrib, NJJurcak, JGBregna, DEBurgher, KLHartman, HBKafka, SKerman, LLKongsamut, SRoehr, JESzewczak, MRWoods-Kettelberger, ATCorbett, R Structure-activity relationships of a series of novel (piperazinylbutyl)thiazolidinone antipsychotic agents related to 3-[4-[4-(6-fluorobenzo[b]thien-3-yl)-1-piperazinyl]butyl]-2,5,5- trimethyl-4-thiazolidinone maleate. J Med Chem 39:4044-57 (1996)  
Target
Name:
D(2) dopamine receptor
Synonyms:
DOPAMINE D2 DOPAMINE D2 Short Dopamine D2 receptor Drd2
Type:
G Protein-Coupled Receptor (GPCR)
Mol. Mass.:
50931.60
Organism:
Rattus norvegicus (rat)
Description:
P61169
Residue:
444
  
Inhibitor
Name:
BDBM50053700
Synonyms:
3-[4-(4-Benzo[d]isothiazol-3-yl-piperazin-1-yl)-butyl]-1-thia-3-aza-spiro[4.5]decan-4-one | CHEMBL131765
Type:
Small organic molecule
Emp. Form.:
C23H32N4OS2
Mol. Mass.:
444.656
SMILES:
O=C1N(CCCCN2CCN(CC2)c2nsc3ccccc23)CSC11CCCCC1
: