Target
Sorbitol dehydrogenase
Ligand
BDBM7460
Substrate
Meas. Tech.
ChEMBL_201008 (CHEMBL803029)
IC50
177000±n/a nM
Citation
 Costantino, LRastelli, GVescovini, KCignarella, GVianello, PDel Corso, ACappiello, MMura, UBarlocco, D Synthesis, activity, and molecular modeling of a new series of tricyclic pyridazinones as selective aldose reductase inhibitors. J Med Chem 39:4396-405 (1996)  
Target
Name:
Sorbitol dehydrogenase
Synonyms:
DHSO_HUMAN SORD
Type:
PROTEIN
Mol. Mass.:
38332.20
Organism:
Homo sapiens (Human)
Description:
ChEMBL_223910
Residue:
357
  
Inhibitor
Name:
BDBM7460
Synonyms:
2-(3,4-dihydroxyphenyl)-3,5,7-trihydroxy-4H-chromen-4-one 2-(3,4-dihydroxyphenyl)-3,5,7-trihydroxy-chromone;hydrate Quercetin Quercetin (21) US11021454, Compound Quercetin med.21724, Compound 4
Type:
Small organic molecule
Emp. Form.:
C15H10O7
Mol. Mass.:
302.2357
SMILES:
Oc1cc(O)c2c(c1)oc(-c1ccc(O)c(O)c1)c(O)c2=O
: