Target
Aldo-keto reductase family 1 member B1 [K65Q]
Ligand
BDBM50054318
Substrate
Meas. Tech.
ChEMBL_32263 (CHEMBL645597)
IC50
162000±n/a nM
Citation
 Costantino, LRastelli, GVescovini, KCignarella, GVianello, PDel Corso, ACappiello, MMura, UBarlocco, D Synthesis, activity, and molecular modeling of a new series of tricyclic pyridazinones as selective aldose reductase inhibitors. J Med Chem 39:4396-405 (1996)  
Target
Name:
Aldo-keto reductase family 1 member B1 [K65Q]
Synonyms:
AKR1B1 Aldose reductase
Type:
Protein
Mol. Mass.:
35916.27
Organism:
Bos taurus (Cattle)
Description:
P16116[K65Q]
Residue:
315
  
Inhibitor
Name:
BDBM50054318
Synonyms:
3-(8,9-Dimethoxy-3-oxo-5,6-dihydro-3H-benzo[h]cinnolin-2-yl)-propionic acid | CHEMBL423179
Type:
Small organic molecule
Emp. Form.:
C17H18N2O5
Mol. Mass.:
330.3352
SMILES:
COc1cc2CCc3cc(=O)n(CCC(O)=O)nc3-c2cc1OC
: