Target
Aldo-keto reductase family 1 member B1 [K65Q]
Ligand
BDBM50054323
Substrate
Meas. Tech.
ChEMBL_32263 (CHEMBL645597)
IC50
133000±n/a nM
Citation
 Costantino, LRastelli, GVescovini, KCignarella, GVianello, PDel Corso, ACappiello, MMura, UBarlocco, D Synthesis, activity, and molecular modeling of a new series of tricyclic pyridazinones as selective aldose reductase inhibitors. J Med Chem 39:4396-405 (1996)  
Target
Name:
Aldo-keto reductase family 1 member B1 [K65Q]
Synonyms:
AKR1B1 Aldose reductase
Type:
Protein
Mol. Mass.:
35916.27
Organism:
Bos taurus (Cattle)
Description:
P16116[K65Q]
Residue:
315
  
Inhibitor
Name:
BDBM50054323
Synonyms:
3-(3-Oxo-5,6-dihydro-3H-benzo[h]cinnolin-2-yl)-propionic acid | CHEMBL342420
Type:
Small organic molecule
Emp. Form.:
C15H14N2O3
Mol. Mass.:
270.2833
SMILES:
OC(=O)CCn1nc-2c(CCc3ccccc-23)cc1=O
: