Target
Aldo-keto reductase family 1 member B1 [K65Q]
Ligand
BDBM16314
Substrate
Meas. Tech.
ChEMBL_32263 (CHEMBL645597)
IC50
96±n/a nM
Citation
 Costantino, LRastelli, GVescovini, KCignarella, GVianello, PDel Corso, ACappiello, MMura, UBarlocco, D Synthesis, activity, and molecular modeling of a new series of tricyclic pyridazinones as selective aldose reductase inhibitors. J Med Chem 39:4396-405 (1996)  
Target
Name:
Aldo-keto reductase family 1 member B1 [K65Q]
Synonyms:
AKR1B1 Aldose reductase
Type:
Protein
Mol. Mass.:
35916.27
Organism:
Bos taurus (Cattle)
Description:
P16116[K65Q]
Residue:
315
  
Inhibitor
Name:
BDBM16314
Synonyms:
2-{[6-methoxy-5-(trifluoromethyl)naphthalen-1-yl]-N-methylmethanethioamido}acetic acid CHEMBL436 Tolrestat
Type:
Small organic molecule
Emp. Form.:
C16H14F3NO3S
Mol. Mass.:
357.347
SMILES:
COc1ccc2c(cccc2c1C(F)(F)F)C(=S)N(C)CC(O)=O
: