Target
Proteinase-activated receptor 1
Ligand
BDBM50054903
Substrate
Meas. Tech.
ChEMBL_209251 (CHEMBL815692)
IC50
19±n/a nM
Citation
 Bernatowicz, MSKlimas, CEHartl, KSPeluso, MAllegretto, NJSeiler, SM Development of potent thrombin receptor antagonist peptides. J Med Chem 39:4879-87 (1997)  
Target
Name:
Proteinase-activated receptor 1
Synonyms:
CF2R F2R PAR1 Proteinase activated receptor 1 TR Thrombin receptor/ Proteinase-activated receptor 1(Par-1)
Type:
Protein
Mol. Mass.:
47450.07
Organism:
Homo sapiens (Human)
Description:
P25116
Residue:
425
  
Inhibitor
Name:
BDBM50054903
Synonyms:
2-[2-[2-{Acetyl-[(E)-3-(4-fluoro-phenyl)-acryloyl]-amino}-3-(4-fluoro-phenyl)-propionylamino]-3-(4-guanidino-phenyl)-propionylamino]-4-methyl-pentanoic acid [1-(1-carbamoyl-4-guanidino-butylcarbamoyl)-4-guanidino-butyl]-amide | CHEMBL263088
Type:
Small organic molecule
Emp. Form.:
C48H65F2N15O7
Mol. Mass.:
1002.1228
SMILES:
[#6]-[#6](-[#6])-[#6]-[#6](-[#7]-[#6](=O)-[#6](-[#6]-c1ccc(cc1)\[#7]=[#6](\[#7])-[#7])-[#7]-[#6](=O)-[#6](-[#6]-c1ccc(F)cc1)-[#7](-[#6](-[#6])=O)-[#6](=O)-[#6]=[#6]-c1ccc(F)cc1)-[#6](=O)-[#7]-[#6](-[#6]-[#6]-[#6]-[#7]-[#6](-[#7])=[#7])-[#6](=O)-[#7]-[#6](-[#6]-[#6]-[#6]-[#7]-[#6](-[#7])=[#7])-[#6](-[#7])=O
: