Target
Acetylcholinesterase
Ligand
BDBM50055176
Substrate
Meas. Tech.
ChEMBL_27805 (CHEMBL636515)
IC50
597000±n/a nM
Citation
 Cho, SJGarsia, MLBier, JTropsha, A Structure-based alignment and comparative molecular field analysis of acetylcholinesterase inhibitors. J Med Chem 39:5064-71 (1997)  
Target
Name:
Acetylcholinesterase
Synonyms:
3.1.1.7 Acetylcholinesterase (AChE) ache
Type:
Mol. Mass.:
65900.74
Organism:
Tetronarce californica (Pacific electric ray) (Torpedo californica)
Description:
P04058
Residue:
586
  
Inhibitor
Name:
BDBM50055176
Synonyms:
(4-Bromo-butyl)-trimethyl-ammonium; bromide CHEMBL357451
Type:
Small organic molecule
Emp. Form.:
C7H17BrN
Mol. Mass.:
195.12
SMILES:
C[N+](C)(C)CCCCBr
: