Target
Acetylcholinesterase
Ligand
BDBM50055208
Substrate
Meas. Tech.
ChEMBL_27805 (CHEMBL636515)
IC50
1760000±n/a nM
Citation
 Cho, SJGarsia, MLBier, JTropsha, A Structure-based alignment and comparative molecular field analysis of acetylcholinesterase inhibitors. J Med Chem 39:5064-71 (1997)  
Target
Name:
Acetylcholinesterase
Synonyms:
3.1.1.7 Acetylcholinesterase (AChE) ache
Type:
Mol. Mass.:
65900.74
Organism:
Tetronarce californica (Pacific electric ray) (Torpedo californica)
Description:
P04058
Residue:
586
  
Inhibitor
Name:
BDBM50055208
Synonyms:
(S)-2-Hydroxy-4,4-dimethyl-morpholin-4-ium; chloride CHEMBL345031
Type:
Small organic molecule
Emp. Form.:
C6H14NO2
Mol. Mass.:
132.1803
SMILES:
C[N+]1(C)CCO[C@H](O)C1
: