Target
Type-1 angiotensin II receptor
Ligand
BDBM50049185
Substrate
Meas. Tech.
ChEMBL_34648 (CHEMBL649707)
IC50
0.330000±n/a nM
Citation
 Wexler, RRGreenlee, WJIrvin, JDGoldberg, MRPrendergast, KSmith, RDTimmermans, PB Nonpeptide angiotensin II receptor antagonists: the next generation in antihypertensive therapy. J Med Chem 39:625-56 (1996)  
Target
Name:
Type-1 angiotensin II receptor
Synonyms:
AGTR1 ANGIOTENSIN AT1 Angiotensin II type 1a (AT-1a) receptor
Type:
Enzyme Catalytic Domain
Mol. Mass.:
41009.15
Organism:
RABBIT
Description:
ANGIOTENSIN AT1 AGTR1 RABBIT::P34976
Residue:
359
  
Inhibitor
Name:
BDBM50049185
Synonyms:
4'-[2-Butyl-6-(3-isopropyl-3-methyl-ureido)-4-oxo-4H-quinazolin-3-ylmethyl]-biphenyl-2-sulfonic acid benzyloxycarbonylamide(L-162620) Imidazo[4,5-b]pyridine derivative | L-162620
Type:
Small organic molecule
Emp. Form.:
C35H37N5O5S
Mol. Mass.:
639.764
SMILES:
CCCC(=O)Nc1cnc2n(Cc3ccc(cc3)-c3ccccc3S(=O)(=O)NC(=O)OCc3ccccc3)c(CCC)nc2c1C
: