Target
D(2) dopamine receptor
Ligand
BDBM55121
Substrate
Meas. Tech.
ChEMBL_61461 (CHEMBL671442)
Kd
17000±n/a nM
Citation
 Brusniak, MYPearlman, RSNeve, KAWilcox, RE Comparative molecular field analysis-based prediction of drug affinities at recombinant D1A dopamine receptors. J Med Chem 39:850-9 (1996)  
Target
Name:
D(2) dopamine receptor
Synonyms:
DOPAMINE D2 DOPAMINE D2 Short Dopamine D2 receptor Drd2
Type:
G Protein-Coupled Receptor (GPCR)
Mol. Mass.:
50931.60
Organism:
Rattus norvegicus (rat)
Description:
P61169
Residue:
444
  
Inhibitor
Name:
BDBM55121
Synonyms:
3-HYDROXYTYRAMINE HYDROCHLORIDE 4-(2-aminoethyl)pyrocatechol;hydrochloride Dopamine SMR000059081 | cid_65340
Type:
Small organic molecule
Emp. Form.:
C8H11NO2
Mol. Mass.:
153.1784
SMILES:
NCCc1ccc(O)c(O)c1
: