Target
Sodium-dependent dopamine transporter
Ligand
BDBM50052015
Substrate
Meas. Tech.
ChEMBL_61688 (CHEMBL872503)
Ki
17±n/a nM
Citation
 Aronson, BEnmon, JLIzenwasser, SKatz, JLKelkar, SVLuo, LNolan, SPTrudell, ML Synthesis and ligand binding of eta(6)-(2beta-carbomethoxy-3beta-phenyltropane) transition metal complexes. J Med Chem 39:1560-3 (1996)  
Target
Name:
Sodium-dependent dopamine transporter
Synonyms:
DA transporter DAT1 Dopamine transporter protein (DAT) SC6A3_HUMAN Sodium-dependent dopamine transporter Solute carrier family 6 member 3
Type:
Multi-pass membrane protein
Mol. Mass.:
68497.11
Organism:
Homo sapiens (Human)
Description:
Q01959
Residue:
620
  
Inhibitor
Name:
BDBM50052015
Synonyms:
CHEMBL178011 tri carbonyl methyl (3S,5R)-8-methyl-3-phenyl-8-azabicyclo[3.2.1]octane-2-carboxylate chromiumIII
Type:
Small organic molecule
Emp. Form.:
C16H21NO2
Mol. Mass.:
259.3434
SMILES:
COC(=O)C1C2CCC(CC1c1ccccc1)N2C
: