Target
Sodium-dependent dopamine transporter
Ligand
BDBM50366564
Substrate
Meas. Tech.
ChEMBL_61689 (CHEMBL671773)
Ki
314±n/a nM
Citation
 Aronson, BEnmon, JLIzenwasser, SKatz, JLKelkar, SVLuo, LNolan, SPTrudell, ML Synthesis and ligand binding of eta(6)-(2beta-carbomethoxy-3beta-phenyltropane) transition metal complexes. J Med Chem 39:1560-3 (1996)  
Target
Name:
Sodium-dependent dopamine transporter
Synonyms:
DA transporter DAT1 Dopamine transporter protein (DAT) SC6A3_HUMAN Sodium-dependent dopamine transporter Solute carrier family 6 member 3
Type:
Multi-pass membrane protein
Mol. Mass.:
68497.11
Organism:
Homo sapiens (Human)
Description:
Q01959
Residue:
620
  
Inhibitor
Name:
BDBM50366564
Synonyms:
CHEMBL1790051 WIN-35065-2
Type:
Small organic molecule
Emp. Form.:
C16H21NO2
Mol. Mass.:
259.3434
SMILES:
COC(=O)[C@@H]1C2CC[C@H](C[C@@H]1c1ccccc1)N2C
: