Target
Neuromedin-K receptor
Ligand
BDBM50079412
Substrate
Meas. Tech.
ChEMBL_209397 (CHEMBL811329)
IC50
2±n/a nM
Citation
 Boden, PEden, JMHodgson, JHorwell, DCHughes, JMcKnight, ATLewthwaite, RAPritchard, MCRaphy, JMeecham, KRatcliffe, GSSuman-Chauhan, NWoodruff, GN Use of a dipeptide chemical library in the development of non-peptide tachykinin NK3 receptor selective antagonists. J Med Chem 39:1664-75 (1996)  
Target
Name:
Neuromedin-K receptor
Synonyms:
NK-3 receptor NK3R NKR Neurokinin B receptor Neuromedin-3 receptor (NK-3R) Neuromedin-K receptor Neuromedin-K receptor (NK3) TAC3R Tachykinin receptor 3 | Tachykinin receptor 3 (NK3)
Type:
Enzyme
Mol. Mass.:
52221.96
Organism:
Homo sapiens (Human)
Description:
P29371
Residue:
465
  
Inhibitor
Name:
BDBM50079412
Synonyms:
(NKB)Asp-Met-His-Asp-Phe-Phe-Val-Gly-Leu-Met-NH2 Asp-Met-His-Asp-Phe-Phe-Val-Gly-Leu-Met-NH2(Neurokinin B) NKB | Neurokinin B
Type:
Small organic molecule
Emp. Form.:
C55H79N13O14S2
Mol. Mass.:
1210.424
SMILES:
CSCC[C@H](NC(=O)[C@H](CC(C)C)NC(=O)CNC(=O)[C@@H](NC(=O)[C@H](Cc1ccccc1)NC(=O)[C@H](Cc1ccccc1)NC(=O)[C@H](CC(O)=O)NC(=O)[C@H](Cc1cnc[nH]1)NC(=O)[C@H](CCSC)NC(=O)[C@@H](N)CC(O)=O)C(C)C)C(N)=O
: