Target
Integrin alpha-IIb/beta-3
Ligand
BDBM50033030
Substrate
Meas. Tech.
ChEMBL_70311 (CHEMBL678016)
Kd
600±n/a nM
Citation
 Askew, BCBednar, RABednar, BClaremon, DACook, JJMcIntyre, CJHunt, CAGould, RJLynch, RJLynch, JJGaul, SLStranieri, MTSitko, GRHolahan, MAGlass, JDHamill, TGorham, LMPrueksaritanont, TBaldwin, JJHartman, GD Non-peptide glycoprotein IIb/IIIa inhibitors. 17. Design and synthesis of orally active, long-acting non-peptide fibrinogen receptor antagonists. J Med Chem 40:1779-88 (1997)  
Target
Name:
Integrin alpha-IIb/beta-3
Synonyms:
Glycoprotein IIb/IIIa
Type:
Mol. Mass.:
Description:
ASSAY_ID of EBI is 30109
Components:
This complex has 2 components.
Component 1
Name:
Integrin beta-3
Synonyms:
CD_antigen=CD61 GPIIIa ITGB3 Platelet membrane glycoprotein IIIa
Type:
Protein
Mol. Mass.:
87038.91
Organism:
Homo sapiens (Human)
Description:
P05106
Residue:
788
  
Component 2
Name:
Integrin alpha-IIb
Synonyms:
CD_antigen=CD41 GPIIb Glycoprotein IIb ITGA2B Integrin alpha-IIb heavy chain Integrin alpha-IIb light chain, form 2 Integrin alpha-V/beta-3 and alpha-IIb/beta 3 | Platelet membrane glycoprotein IIb
Type:
Protein
Mol. Mass.:
113354.85
Organism:
Homo sapiens (Human)
Description:
P08514
Residue:
1039
  
Inhibitor
Name:
BDBM50033030
Synonyms:
(R)-3-{2-[(R)-2-Oxo-3-(2-piperidin-4-yl-ethyl)-piperidin-1-yl]-acetylamino}-butyric acid CHEMBL48371 | L-734217
Type:
Small organic molecule
Emp. Form.:
C18H31N3O4
Mol. Mass.:
353.4564
SMILES:
C[C@H](CC(O)=O)NC(=O)CN1CCC[C@@H](CCC2CCNCC2)C1=O
: