Target
P-selectin
Ligand
BDBM50060514
Substrate
Meas. Tech.
ChEMBL_200024 (CHEMBL810713)
IC50
500±n/a nM
Citation
 Tsukida, THiramatsu, YTsujishita, HKiyoi, TYoshida, MKurokawa, KMoriyama, HOhmoto, HWada, YSaito, TKondo, H Studies on selection blockers. 5. Design, synthesis, and biological profile of sialyl Lewis x mimetics based on modified serine-glutamic acid dipeptides. J Med Chem 40:3534-41 (1997)  
Target
Name:
P-selectin
Synonyms:
CD62 antigen-like family member P GMP-140 Grmp LYAM3_MOUSE PADGEM | Selp
Type:
PROTEIN
Mol. Mass.:
83091.41
Organism:
Mus musculus
Description:
ChEMBL_200024
Residue:
768
  
Inhibitor
Name:
BDBM50060514
Synonyms:
(S)-4-Methylcarbamoyl-4-[(R)-2-(2-tetradecyl-hexadecanoylamino)-3-(3,4,5-trihydroxy-6-methyl-tetrahydro-pyran-2-yloxy)-propionylamino]-butyric acid | CHEMBL119836
Type:
Small organic molecule
Emp. Form.:
C45H85N3O10
Mol. Mass.:
828.1705
SMILES:
CCCCCCCCCCCCCCC(CCCCCCCCCCCCCC)C(=O)N[C@H](COC1OC(C)C(O)C(O)C1O)C(=O)N[C@@H](CCC(O)=O)C(=O)NC
: