Target
Glutamate receptor 2
Ligand
BDBM50060630
Substrate
Meas. Tech.
ChEMBL_90152 (CHEMBL696974)
Ki
19±n/a nM
Citation
 Jane, DEHoo, KKamboj, RDeverill, MBleakman, DMandelzys, A Synthesis of willardiine and 6-azawillardiine analogs: pharmacological characterization on cloned homomeric human AMPA and kainate receptor subtypes. J Med Chem 40:3645-50 (1997)  
Target
Name:
Glutamate receptor 2
Synonyms:
AMPA-selective glutamate receptor 2 GRIA2 GluR-2 GluR-K2 Glutamate receptor 2 Glutamate receptor AMPA 2/3 Glutamate receptor ionotropic, AMPA 2
Type:
Enzyme Catalytic Domain
Mol. Mass.:
98825.96
Organism:
Homo sapiens (Human)
Description:
Glutamate AMPA 2 GRIA2 HUMAN::P42262
Residue:
883
  
Inhibitor
Name:
BDBM50060630
Synonyms:
(S)-2-Amino-3-(6-bromo-3,5-dioxo-4,5-dihydro-3H-[1,2,4]triazin-2-yl)-propionic acid | CHEMBL331644
Type:
Small organic molecule
Emp. Form.:
C6H7BrN4O4
Mol. Mass.:
279.048
SMILES:
N[C@@H](Cn1nc(Br)c(=O)[nH]c1=O)C(O)=O
: