Target
Glutamate receptor ionotropic, kainate 5
Ligand
BDBM50060635
Substrate
Meas. Tech.
ChEMBL_90444 (CHEMBL698076)
Ki
1820±n/a nM
Citation
 Jane, DEHoo, KKamboj, RDeverill, MBleakman, DMandelzys, A Synthesis of willardiine and 6-azawillardiine analogs: pharmacological characterization on cloned homomeric human AMPA and kainate receptor subtypes. J Med Chem 40:3645-50 (1997)  
Target
Name:
Glutamate receptor ionotropic, kainate 5
Synonyms:
GRIK2 GRIK5_HUMAN Glutamate receptor, ionotropic kainate 5 Ionotropic glutamate receptor kainate 2/5
Type:
Enzyme Catalytic Domain
Mol. Mass.:
109280.81
Organism:
Homo sapiens (Human)
Description:
Glutamate-Kainate 5 Grik5 HUMAN::Q16478
Residue:
980
  
Inhibitor
Name:
BDBM50060635
Synonyms:
(S)-2-Amino-3-(5-fluoro-2,4-dioxo-3,4-dihydro-2H-pyrimidin-1-yl)-propionic acid (S)-5-Fluorowillardiine CHEMBL123132 | Fluorowillardiine
Type:
Small organic molecule
Emp. Form.:
C7H8FN3O4
Mol. Mass.:
217.1545
SMILES:
N[C@@H](Cn1cc(F)c(=O)[nH]c1=O)C(O)=O
: