Target
D(2) dopamine receptor
Ligand
BDBM50061665
Substrate
Meas. Tech.
ChEMBL_62884 (CHEMBL673594)
Ki
0.30±n/a nM
Citation
 Mewshaw, REKavanagh, JStack, GMarquis, KLShi, XKagan, MZWebb, MBKatz, AHPark, AKang, YHAbou-Gharbia, MScerni, RWasik, TCortes-Burgos, LSpangler, TBrennan, JAPiesla, MMazandarani, HCockett, MIOchalski, RCoupet, JAndree, TH New generation dopaminergic agents. 1. Discovery of a novel scaffold which embraces the D2 agonist pharmacophore. Structure-activity relationships of a series of 2-(aminomethyl)chromans. J Med Chem 40:4235-56 (1998)  
Target
Name:
D(2) dopamine receptor
Synonyms:
DOPAMINE D2 DOPAMINE D2 Short Dopamine D2 receptor Drd2
Type:
G Protein-Coupled Receptor (GPCR)
Mol. Mass.:
50931.60
Organism:
Rattus norvegicus (rat)
Description:
P61169
Residue:
444
  
Inhibitor
Name:
BDBM50061665
Synonyms:
2-[(4-Chloro-benzylamino)-methyl]-chroman-7-ol; oxalic acid | CHEMBL135873
Type:
Small organic molecule
Emp. Form.:
C17H18ClNO2
Mol. Mass.:
303.783
SMILES:
Oc1ccc2CCC(CNCc3ccc(Cl)cc3)Oc2c1
: